{"text_format":"1","workbook":"xlsx","n_sheets":5,"sheets":["Welcome","Application_Page","appcopy","Texts","Data fields"],"not_rendered":{"charts":0,"images":11,"macros":1,"external_links":0,"defined_names":10,"comments":1,"pivot_tables":0},"unopened":[],"bounds":{"document_bytes":16777216,"sheet_cells":100000,"rows_first":2000,"rows_last":500,"rows_between":2000,"halvings":0,"cell_chars":16384,"cell_head_chars":4096},"cells_cut":0,"cells_raw":0,"read":"whole","date_system":"1904"}

{"sheet":"Welcome","index":0,"n_rows":20,"n_cols":14,"rows_kept":20,"cut":false,"hidden":false,"merged":[[1,6,2,11],[10,1,10,4],[1,0,29,0],[4,2,4,15],[0,0,0,15],[14,1,14,3],[14,4,14,9],[8,5,8,15],[6,5,6,15],[6,1,6,4],[8,1,8,4],[9,1,9,4]]}
[]
[null,null,null,null,null,null,{"$f":"INDEX(Texts!$A$1:$C$61,2,Welcome!N19)","v":"Welcome"}]
[]
[]
[null,null,{"$f":"INDEX(Texts!$A$2:$C$61,2,Welcome!N19)","v":"This template will aid in the submission of personal data to the Tokyo 2020 accreditation system. It will check for errors in the data that you are about to submit. Once all your data is correct, you will be able to generate an import file to load in the accreditation system.\n"}]
[]
[null,{"$f":"INDEX(Texts!$A$2:$C$61,3,Welcome!N19)","v":"Organisation:"}]
[]
[null,{"$f":"INDEX(Texts!$A$2:$C$61,4,Welcome!N19)","v":"Tokyo 2020 Accreditation Contact:"}]
[null,{"$f":"INDEX(Texts!$A$2:$C$61,6,Welcome!N19)","v":"Select your language:"}]
{"$rows_left_out":11}
{"sheet":"Application_Page","index":1,"n_rows":207,"n_cols":39,"rows_kept":207,"cut":false,"hidden":false,"merged":[]}
[null,"Organisation","Function","Discipline(s)","All competing disciplines","Family name","Given name","Middle/other given name(s)","Preferred family name","Preferred given name","IF family name","IF given name","Family name (Japanese)","Given name (Japanese)","Gender","Date of birth","Nationality","Document type","Document number","Country of issue","Date of expiry","Daily wheelchair user","Mobile phone","Home phone","Email address","Photograph","Height","Organisation reference","Athlete 365 Acceptance","Athlete 365 Email Address","SNS type 1","SNS profile 1","SNS type 2","SNS profile 2","SNS type 3","SNS profile 3","SNS type 4","SNS profile 4"]
[{"$f":"INDEX(Texts!$A$2:$C$15,10,Welcome!N19)","v":"FIELD"},{"$f":"VLOOKUP(B1,'Data fields'!$A$2:$D$42,Welcome!$N$19+1,FALSE)","v":"Organisation"},{"$f":"VLOOKUP(C1,'Data fields'!$A$2:$D$42,Welcome!$N$19+1,FALSE)","v":"Function"},{"$f":"VLOOKUP(D1,'Data fields'!$A$2:$D$42,Welcome!$N$19+1,FALSE)","v":"Discipline(s)"},{"$f":"VLOOKUP(E1,'Data fields'!$A$2:$D$42,Welcome!$N$19+1,FALSE)","v":"All competing disciplines"},{"$f":"VLOOKUP(F1,'Data fields'!$A$2:$D$42,Welcome!$N$19+1,FALSE)","v":"Family name"},{"$f":"VLOOKUP(G1,'Data fields'!$A$2:$D$42,Welcome!$N$19+1,FALSE)","v":"Given name"},{"$f":"VLOOKUP(H1,'Data fields'!$A$2:$D$42,Welcome!$N$19+1,FALSE)","v":"Middle/other given name(s)"},{"$f":"VLOOKUP(I1,'Data fields'!$A$2:$D$42,Welcome!$N$19+1,FALSE)","v":"Preferred family name"},{"$f":"VLOOKUP(J1,'Data fields'!$A$2:$D$42,Welcome!$N$19+1,FALSE)","v":"Preferred given name"},{"$f":"VLOOKUP(K1,'Data fields'!$A$2:$D$42,Welcome!$N$19+1,FALSE)","v":"IF family name"},{"$f":"VLOOKUP(L1,'Data fields'!$A$2:$D$42,Welcome!$N$19+1,FALSE)","v":"IF given name"},{"$f":"VLOOKUP(M1,'Data fields'!$A$2:$D$42,Welcome!$N$19+1,FALSE)","v":"Family name (in Japanese)"},{"$f":"VLOOKUP(N1,'Data fields'!$A$2:$D$42,Welcome!$N$19+1,FALSE)","v":"Given name (in Japanese)"},{"$f":"VLOOKUP(O1,'Data fields'!$A$2:$D$42,Welcome!$N$19+1,FALSE)","v":"Gender"},{"$f":"VLOOKUP(P1,'Data fields'!$A$2:$D$42,Welcome!$N$19+1,FALSE)","v":"Date of birth"},{"$f":"VLOOKUP(Q1,'Data fields'!$A$2:$D$42,Welcome!$N$19+1,FALSE)","v":"Nationality"},{"$f":"VLOOKUP(R1,'Data fields'!$A$2:$D$42,Welcome!$N$19+1,FALSE)","v":"Document type"},{"$f":"VLOOKUP(S1,'Data fields'!$A$2:$D$42,Welcome!$N$19+1,FALSE)","v":"Document number"},{"$f":"VLOOKUP(T1,'Data fields'!$A$2:$D$42,Welcome!$N$19+1,FALSE)","v":"Country of issue"},{"$f":"VLOOKUP(U1,'Data fields'!$A$2:$D$42,Welcome!$N$19+1,FALSE)","v":"Date of expiry"},{"$f":"VLOOKUP(V1,'Data fields'!$A$2:$D$42,Welcome!$N$19+1,FALSE)","v":"Daily wheelchair user"},{"$f":"VLOOKUP(W1,'Data fields'!$A$2:$D$42,Welcome!$N$19+1,FALSE)","v":"Mobile phone"},{"$f":"VLOOKUP(X1,'Data fields'!$A$2:$D$42,Welcome!$N$19+1,FALSE)","v":"Home phone"},{"$f":"VLOOKUP(Y1,'Data fields'!$A$2:$D$42,Welcome!$N$19+1,FALSE)","v":"Email address"},{"$f":"VLOOKUP(Z1,'Data fields'!$A$2:$D$42,Welcome!$N$19+1,FALSE)","v":"Photograph"},{"$f":"VLOOKUP(AA1,'Data fields'!$A$2:$D$42,Welcome!$N$19+1,FALSE)","v":"Height"},{"$f":"VLOOKUP(AB1,'Data fields'!$A$2:$D$42,Welcome!$N$19+1,FALSE)","v":"Organisation reference"},{"$f":"VLOOKUP(AC1,'Data fields'!$A$2:$D$42,Welcome!$N$19+1,FALSE)","v":"Athlete 365 Acceptance"},{"$f":"VLOOKUP(AD1,'Data fields'!$A$2:$D$42,Welcome!$N$19+1,FALSE)","v":"Athlete 365 Email Address"},{"$f":"VLOOKUP(AE1,'Data fields'!$A$2:$D$42,Welcome!$N$19+1,FALSE)","v":"SNS type 1"},{"$f":"VLOOKUP(AF1,'Data fields'!$A$2:$D$42,Welcome!$N$19+1,FALSE)","v":"SNS profile 1"},{"$f":"VLOOKUP(AG1,'Data fields'!$A$2:$D$42,Welcome!$N$19+1,FALSE)","v":"SNS type 2"},{"$f":"VLOOKUP(AH1,'Data fields'!$A$2:$D$42,Welcome!$N$19+1,FALSE)","v":"SNS profile 2"},{"$f":"VLOOKUP(AI1,'Data fields'!$A$2:$D$42,Welcome!$N$19+1,FALSE)","v":"SNS type 3"},{"$f":"VLOOKUP(AJ1,'Data fields'!$A$2:$D$42,Welcome!$N$19+1,FALSE)","v":"SNS profile 3"},{"$f":"VLOOKUP(AK1,'Data fields'!$A$2:$D$42,Welcome!$N$19+1,FALSE)","v":"SNS type 4"},{"$f":"VLOOKUP(AL1,'Data fields'!$A$2:$D$42,Welcome!$N$19+1,FALSE)","v":"SNS profile 4"}]
[{"$f":"INDEX(Texts!$A$2:$C$15,11,Welcome!N19)","v":"DESCRIPTION"},{"$f":"VLOOKUP(B1,'Data fields'!$A$2:$G$62,Welcome!$N$19+4,FALSE)","v":"Enter the Organisation CODE"},{"$f":"VLOOKUP(C1,'Data fields'!$A$2:$G$62,Welcome!$N$19+4,FALSE)","v":"Enter the Function CODE"},{"$f":"VLOOKUP(D1,'Data fields'!$A$2:$G$62,Welcome!$N$19+4,FALSE)","v":"Enter the discipline(s) CODE(s). Separate with comma (,) for more than one code"},{"$f":"VLOOKUP(E1,'Data fields'!$A$2:$G$62,Welcome!$N$19+4,FALSE)","v":"Enter 'Y' for Yes or 'N' for No"},{"$f":"VLOOKUP(F1,'Data fields'!$A$2:$G$62,Welcome!$N$19+4,FALSE)","v":"Enter Family Name exactly as it appears on Identification Document"},{"$f":"VLOOKUP(G1,'Data fields'!$A$2:$G$62,Welcome!$N$19+4,FALSE)","v":"Enter first Given Name exactly as it appears on Identification Document"},{"$f":"VLOOKUP(H1,'Data fields'!$A$2:$G$62,Welcome!$N$19+4,FALSE)","v":"Enter Middle/other given name(s) exactly as it appears on Identification Document"},{"$f":"VLOOKUP(I1,'Data fields'!$A$2:$G$62,Welcome!$N$19+4,FALSE)","v":"Enter the Preferred family name"},{"$f":"VLOOKUP(J1,'Data fields'!$A$2:$G$62,Welcome!$N$19+4,FALSE)","v":"Enter the Preferred given name"},{"$f":"VLOOKUP(K1,'Data fields'!$A$2:$G$62,Welcome!$N$19+4,FALSE)","v":"Enter IF family name"},{"$f":"VLOOKUP(L1,'Data fields'!$A$2:$G$62,Welcome!$N$19+4,FALSE)","v":"Enter IF given name"},{"$f":"VLOOKUP(M1,'Data fields'!$A$2:$G$62,Welcome!$N$19+4,FALSE)","v":"Enter the local Family name (for Japanese nationals only)"},{"$f":"VLOOKUP(N1,'Data fields'!$A$2:$G$62,Welcome!$N$19+4,FALSE)","v":"Enter the local given name (for Japanese nationals only)"},{"$f":"VLOOKUP(O1,'Data fields'!$A$2:$G$62,Welcome!$N$19+4,FALSE)","v":"Enter the Gender CODE ('M' for Male, 'F' for Female or 'X' (only if in passport))"},{"$f":"VLOOKUP(P1,'Data fields'!$A$2:$G$62,Welcome!$N$19+4,FALSE)","v":"Enter the Date of Birth"},{"$f":"VLOOKUP(Q1,'Data fields'!$A$2:$G$62,Welcome!$N$19+4,FALSE)","v":"Enter the Country CODE"},{"$f":"VLOOKUP(R1,'Data fields'!$A$2:$G$62,Welcome!$N$19+4,FALSE)","v":"Enter the Document Type CODE"},{"$f":"VLOOKUP(S1,'Data fields'!$A$2:$G$62,Welcome!$N$19+4,FALSE)","v":"Enter the Document number"},{"$f":"VLOOKUP(T1,'Data fields'!$A$2:$G$62,Welcome!$N$19+4,FALSE)","v":"Enter the \nCountry CODE"},{"$f":"VLOOKUP(U1,'Data fields'!$A$2:$G$62,Welcome!$N$19+4,FALSE)","v":"Enter the Document expiry date"},{"$f":"VLOOKUP(V1,'Data fields'!$A$2:$G$62,Welcome!$N$19+4,FALSE)","v":"Type 'YE' for 'Yes electric wheelchair' , 'YM' for 'Yes manual wheelchair', 'N' for \"No"},{"$f":"VLOOKUP(W1,'Data fields'!$A$2:$G$62,Welcome!$N$19+4,FALSE)","v":"Enter home Phone number"},{"$f":"VLOOKUP(X1,'Data fields'!$A$2:$G$62,Welcome!$N$19+4,FALSE)","v":"Enter mobile Phone number"},{"$f":"VLOOKUP(Y1,'Data fields'!$A$2:$G$62,Welcome!$N$19+4,FALSE)","v":"Enter the Email address of the applicant"},{"$f":"VLOOKUP(Z1,'Data fields'!$A$2:$G$62,Welcome!$N$19+4,FALSE)","v":"Enter the exact file name including the file extension"},{"$f":"VLOOKUP(AA1,'Data fields'!$A$2:$G$62,Welcome!$N$19+4,FALSE)","v":"Enter the Height in centimetres (mandatory for some disciplines)"},{"$f":"VLOOKUP(AB1,'Data fields'!$A$2:$G$62,Welcome!$N$19+4,FALSE)","v":"Enter the Organisation reference"},{"$f":"VLOOKUP(AC1,'Data fields'!$A$2:$G$62,Welcome!$N$19+4,FALSE)","v":"Enter 'Y' for Yes or 'N' for No"},{"$f":"VLOOKUP(AD1,'Data fields'!$A$2:$G$62,Welcome!$N$19+4,FALSE)","v":"Enter Athlete 365 Email Address"},{"$f":"VLOOKUP(AE1,'Data fields'!$A$2:$G$62,Welcome!$N$19+4,FALSE)","v":"Enter The Social Media Type 1 CODE"},{"$f":"VLOOKUP(AF1,'Data fields'!$A$2:$G$62,Welcome!$N$19+4,FALSE)","v":"Enter Your Social Media profile 1"},{"$f":"VLOOKUP(AG1,'Data fields'!$A$2:$G$62,Welcome!$N$19+4,FALSE)","v":"Enter The Social Media Type 2 CODE"},{"$f":"VLOOKUP(AH1,'Data fields'!$A$2:$G$62,Welcome!$N$19+4,FALSE)","v":"Enter Your Social Media profile 2"},{"$f":"VLOOKUP(AI1,'Data fields'!$A$2:$G$62,Welcome!$N$19+4,FALSE)","v":"Enter The Social Media Type 3 CODE"},{"$f":"VLOOKUP(AJ1,'Data fields'!$A$2:$G$62,Welcome!$N$19+4,FALSE)","v":"Enter Your Social Media profile 3"},{"$f":"VLOOKUP(AK1,'Data fields'!$A$2:$G$62,Welcome!$N$19+4,FALSE)","v":"Enter The Social Media Type 4 CODE"},{"$f":"VLOOKUP(AL1,'Data fields'!$A$2:$G$62,Welcome!$N$19+4,FALSE)","v":"Enter Your Social Media profile 4"}]
[{"$f":"INDEX(Texts!$A$2:$C$15,12,Welcome!N19)","v":"FORMAT"},{"$f":"VLOOKUP(B1,'Data fields'!$A$2:$J$62,10,FALSE)","v":"CODE"},{"$f":"VLOOKUP(C7,'Data fields'!$A$2:$J$62,10,FALSE)","v":"CODE"},{"$f":"VLOOKUP(D7,'Data fields'!$A$2:$J$62,10,FALSE)","v":"CODE"},{"$f":"VLOOKUP(E7,'Data fields'!$A$2:$J$62,10,FALSE)","v":"CODE"},{"$f":"VLOOKUP(F7,'Data fields'!$A$2:$J$62,10,FALSE)","v":"TEXT"},{"$f":"VLOOKUP(G7,'Data fields'!$A$2:$J$62,10,FALSE)","v":"TEXT"},{"$f":"VLOOKUP(H7,'Data fields'!$A$2:$J$62,10,FALSE)","v":"TEXT"},{"$f":"VLOOKUP(I7,'Data fields'!$A$2:$J$62,10,FALSE)","v":"TEXT"},{"$f":"VLOOKUP(J7,'Data fields'!$A$2:$J$62,10,FALSE)","v":"TEXT"},{"$f":"VLOOKUP(K7,'Data fields'!$A$2:$J$62,10,FALSE)","v":"TEXT"},{"$f":"VLOOKUP(L7,'Data fields'!$A$2:$J$62,10,FALSE)","v":"TEXT"},{"$f":"VLOOKUP(M7,'Data fields'!$A$2:$J$62,10,FALSE)","v":"TEXT"},{"$f":"VLOOKUP(N7,'Data fields'!$A$2:$J$62,10,FALSE)","v":"TEXT"},{"$f":"VLOOKUP(O7,'Data fields'!$A$2:$J$62,10,FALSE)","v":"CODE"},{"$f":"VLOOKUP(P7,'Data fields'!$A$2:$J$62,10,FALSE)","v":"DD/MM/YYYY"},{"$f":"VLOOKUP(Q7,'Data fields'!$A$2:$J$62,10,FALSE)","v":"CODE"},{"$f":"VLOOKUP(R7,'Data fields'!$A$2:$J$62,10,FALSE)","v":"CODE"},{"$f":"VLOOKUP(S7,'Data fields'!$A$2:$J$62,10,FALSE)","v":"TEXT/NUMBER"},{"$f":"VLOOKUP(T7,'Data fields'!$A$2:$J$62,10,FALSE)","v":"CODE"},{"$f":"VLOOKUP(U7,'Data fields'!$A$2:$J$62,10,FALSE)","v":"DD/MM/YYYY"},{"$f":"VLOOKUP(V7,'Data fields'!$A$2:$J$62,10,FALSE)","v":"CODE"},{"$f":"VLOOKUP(W7,'Data fields'!$A$2:$J$62,10,FALSE)","v":"TEL NUMBER"},{"$f":"VLOOKUP(X7,'Data fields'!$A$2:$J$62,10,FALSE)","v":"TEL NUMBER"},{"$f":"VLOOKUP(Y7,'Data fields'!$A$2:$J$62,10,FALSE)","v":"TEXT"},{"$f":"VLOOKUP(Z7,'Data fields'!$A$2:$J$62,10,FALSE)","v":"TEXT"},{"$f":"VLOOKUP(AA7,'Data fields'!$A$2:$J$62,10,FALSE)","v":"NUMBER"},{"$f":"VLOOKUP(AB7,'Data fields'!$A$2:$J$62,10,FALSE)","v":"TEXT"},{"$f":"VLOOKUP(AC7,'Data fields'!$A$2:$J$62,10,FALSE)","v":"TEXT"},{"$f":"VLOOKUP(AD7,'Data fields'!$A$2:$J$62,10,FALSE)","v":"TEXT"},{"$f":"VLOOKUP(AE7,'Data fields'!$A$2:$J$62,10,FALSE)","v":"CODE"},{"$f":"VLOOKUP(AF7,'Data fields'!$A$2:$J$62,10,FALSE)","v":"TEXT"},{"$f":"VLOOKUP(AG7,'Data fields'!$A$2:$J$62,10,FALSE)","v":"CODE"},{"$f":"VLOOKUP(AH7,'Data fields'!$A$2:$J$62,10,FALSE)","v":"TEXT"},{"$f":"VLOOKUP(AI7,'Data fields'!$A$2:$J$62,10,FALSE)","v":"CODE"},{"$f":"VLOOKUP(AJ7,'Data fields'!$A$2:$J$62,10,FALSE)","v":"TEXT"},{"$f":"VLOOKUP(AK7,'Data fields'!$A$2:$J$62,10,FALSE)","v":"CODE"},{"$f":"VLOOKUP(AL7,'Data fields'!$A$2:$J$62,10,FALSE)","v":"TEXT"}]
[{"$f":"INDEX(Texts!$A$2:$C$15,13,Welcome!N19)","v":"MAX LENGTH"},{"$f":"VLOOKUP(B1,'Data fields'!$A$2:$J$62,8,FALSE)","v":12},{"$f":"VLOOKUP(C1,'Data fields'!$A$2:$J$62,8,FALSE)","v":12},{"$f":"VLOOKUP(D1,'Data fields'!$A$2:$J$62,8,FALSE)","v":150},{"$f":"VLOOKUP(E1,'Data fields'!$A$2:$J$62,8,FALSE)","v":1},{"$f":"VLOOKUP(F1,'Data fields'!$A$2:$J$62,8,FALSE)","v":25},{"$f":"VLOOKUP(G1,'Data fields'!$A$2:$J$62,8,FALSE)","v":25},{"$f":"VLOOKUP(H1,'Data fields'!$A$2:$J$62,8,FALSE)","v":25},{"$f":"VLOOKUP(I1,'Data fields'!$A$2:$J$62,8,FALSE)","v":25},{"$f":"VLOOKUP(J1,'Data fields'!$A$2:$J$62,8,FALSE)","v":25},{"$f":"VLOOKUP(K1,'Data fields'!$A$2:$J$62,8,FALSE)","v":25},{"$f":"VLOOKUP(L1,'Data fields'!$A$2:$J$62,8,FALSE)","v":25},{"$f":"VLOOKUP(M1,'Data fields'!$A$2:$J$62,8,FALSE)","v":25},{"$f":"VLOOKUP(N1,'Data fields'!$A$2:$J$62,8,FALSE)","v":25},{"$f":"VLOOKUP(O1,'Data fields'!$A$2:$J$62,8,FALSE)","v":1},{"$f":"VLOOKUP(P1,'Data fields'!$A$2:$J$62,8,FALSE)","v":10},{"$f":"VLOOKUP(Q1,'Data fields'!$A$2:$J$62,8,FALSE)","v":3},{"$f":"VLOOKUP(R1,'Data fields'!$A$2:$J$62,8,FALSE)","v":3},{"$f":"VLOOKUP(S1,'Data fields'!$A$2:$J$62,8,FALSE)","v":20},{"$f":"VLOOKUP(T1,'Data fields'!$A$2:$J$62,8,FALSE)","v":3},{"$f":"VLOOKUP(U1,'Data fields'!$A$2:$J$62,8,FALSE)","v":10},{"$f":"VLOOKUP(V1,'Data fields'!$A$2:$J$62,8,FALSE)","v":2},{"$f":"VLOOKUP(W1,'Data fields'!$A$2:$J$62,8,FALSE)","v":20},{"$f":"VLOOKUP(X1,'Data fields'!$A$2:$J$62,8,FALSE)","v":20},{"$f":"VLOOKUP(Y1,'Data fields'!$A$2:$J$62,8,FALSE)","v":80},{"$f":"VLOOKUP(Z1,'Data fields'!$A$2:$J$62,8,FALSE)","v":250},{"$f":"VLOOKUP(AA1,'Data fields'!$A$2:$J$62,8,FALSE)","v":3},{"$f":"VLOOKUP(AB1,'Data fields'!$A$2:$J$62,8,FALSE)","v":25},{"$f":"VLOOKUP(AC1,'Data fields'!$A$2:$J$62,8,FALSE)","v":1},{"$f":"VLOOKUP(AD1,'Data fields'!$A$2:$J$62,8,FALSE)","v":80},{"$f":"VLOOKUP(AE1,'Data fields'!$A$2:$J$62,8,FALSE)","v":3},{"$f":"VLOOKUP(AF1,'Data fields'!$A$2:$J$62,8,FALSE)","v":150},{"$f":"VLOOKUP(AG1,'Data fields'!$A$2:$J$62,8,FALSE)","v":3},{"$f":"VLOOKUP(AH1,'Data fields'!$A$2:$J$62,8,FALSE)","v":150},{"$f":"VLOOKUP(AI1,'Data fields'!$A$2:$J$62,8,FALSE)","v":3},{"$f":"VLOOKUP(AJ1,'Data fields'!$A$2:$J$62,8,FALSE)","v":150},{"$f":"VLOOKUP(AK1,'Data fields'!$A$2:$J$62,8,FALSE)","v":3},{"$f":"VLOOKUP(AL1,'Data fields'!$A$2:$J$62,8,FALSE)","v":150}]
[null,{"$f":"VLOOKUP(B7,'Data fields'!$A$2:$J$62,9,FALSE)","v":true},{"$f":"VLOOKUP(C7,'Data fields'!$A$2:$J$62,9,FALSE)","v":true},{"$f":"VLOOKUP(D7,'Data fields'!$A$2:$J$62,9,FALSE)","v":false},{"$f":"VLOOKUP(E7,'Data fields'!$A$2:$J$62,9,FALSE)","v":false},{"$f":"VLOOKUP(F7,'Data fields'!$A$2:$J$62,9,FALSE)","v":true},{"$f":"VLOOKUP(G7,'Data fields'!$A$2:$J$62,9,FALSE)","v":true},{"$f":"VLOOKUP(H7,'Data fields'!$A$2:$J$62,9,FALSE)","v":false},{"$f":"VLOOKUP(I7,'Data fields'!$A$2:$J$62,9,FALSE)","v":false},{"$f":"VLOOKUP(J7,'Data fields'!$A$2:$J$62,9,FALSE)","v":false},{"$f":"VLOOKUP(K7,'Data fields'!$A$2:$J$62,9,FALSE)","v":false},{"$f":"VLOOKUP(L7,'Data fields'!$A$2:$J$62,9,FALSE)","v":false},{"$f":"VLOOKUP(M7,'Data fields'!$A$2:$J$62,9,FALSE)","v":false},{"$f":"VLOOKUP(N7,'Data fields'!$A$2:$J$62,9,FALSE)","v":false},{"$f":"VLOOKUP(O7,'Data fields'!$A$2:$J$62,9,FALSE)","v":true},{"$f":"VLOOKUP(P7,'Data fields'!$A$2:$J$62,9,FALSE)","v":true},{"$f":"VLOOKUP(Q7,'Data fields'!$A$2:$J$62,9,FALSE)","v":true},{"$f":"VLOOKUP(R7,'Data fields'!$A$2:$J$62,9,FALSE)","v":true},{"$f":"VLOOKUP(S7,'Data fields'!$A$2:$J$62,9,FALSE)","v":true},{"$f":"VLOOKUP(T7,'Data fields'!$A$2:$J$62,9,FALSE)","v":false},{"$f":"VLOOKUP(U7,'Data fields'!$A$2:$J$62,9,FALSE)","v":false},{"$f":"VLOOKUP(V7,'Data fields'!$A$2:$J$62,9,FALSE)","v":true},{"$f":"VLOOKUP(W7,'Data fields'!$A$2:$J$62,9,FALSE)","v":false},{"$f":"VLOOKUP(X7,'Data fields'!$A$2:$J$62,9,FALSE)","v":false},{"$f":"VLOOKUP(Y7,'Data fields'!$A$2:$J$62,9,FALSE)","v":false},{"$f":"VLOOKUP(Z7,'Data fields'!$A$2:$J$62,9,FALSE)","v":false},{"$f":"VLOOKUP(AA7,'Data fields'!$A$2:$J$62,9,FALSE)","v":false},{"$f":"VLOOKUP(AB7,'Data fields'!$A$2:$J$62,9,FALSE)","v":false},{"$f":"VLOOKUP(AC7,'Data fields'!$A$2:$J$62,9,FALSE)","v":false},{"$f":"VLOOKUP(AD7,'Data fields'!$A$2:$J$62,9,FALSE)","v":false},{"$f":"VLOOKUP(AE7,'Data fields'!$A$2:$J$62,9,FALSE)","v":false},{"$f":"VLOOKUP(AF7,'Data fields'!$A$2:$J$62,9,FALSE)","v":false},{"$f":"VLOOKUP(AG7,'Data fields'!$A$2:$J$62,9,FALSE)","v":false},{"$f":"VLOOKUP(AH7,'Data fields'!$A$2:$J$62,9,FALSE)","v":false},{"$f":"VLOOKUP(AI7,'Data fields'!$A$2:$J$62,9,FALSE)","v":false},{"$f":"VLOOKUP(AJ7,'Data fields'!$A$2:$J$62,9,FALSE)","v":false},{"$f":"VLOOKUP(AK7,'Data fields'!$A$2:$J$62,9,FALSE)","v":false},{"$f":"VLOOKUP(AL7,'Data fields'!$A$2:$J$62,9,FALSE)","v":false}]
[null,"Organisation","Function","Discipline(s)","All competing disciplines","Family name","Given name","Middle/other given name(s)","Preferred family name","Preferred given name","IF family name","IF given name","Family name (Japanese)","Given name (Japanese)","Gender","Date of birth","Nationality","Document type","Document number","Country of issue","Date of expiry","Daily wheelchair user","Mobile phone","Home phone","Email address","Photograph","Height","Organisation reference","Athlete 365 Acceptance","Athlete 365 Email Address","SNS type 1","SNS profile 1","SNS type 2","SNS profile 2","SNS type 3","SNS profile 3","SNS type 4","SNS profile 4","x"]
["Pole pozostawione puste","Nie wypełniamy","Nie wypełniamy","Nie wypełniamy","Nie wypełniamy","Nazwisko, tak, jak w paszporcie. Bez polskich znaków. Wielkie litery.","Imię, tak, jak w paszporcie. Bez polskich znaków. Wielkie litery.","Jeśli istnieje - drugie imię, imiona tak, jak w paszporcie. Bez polskich znaków. Wielkie litery.","Nazwisko z polskimi znakami. Wielkie oraz małe litery.","Imię z polskimi znakami. Wielkie oraz małe litery.","Nazwisko używane w zawodach międzynarodowych. Dopuszczalne polskie znaki, wielkie oraz małe litery.","Imię używane w zawodach międzynarodowych. Dopuszczalne polskie znaki, wielkie oraz małe litery.","Nie wypełniamy","Nie wypełniamy","Płeć: M-Mężczyzna; F-Kobieta; X-dozwolone, ale tylko jeśli jest w paszporcie","Data urodzin według formatu: Dzień/Miesiąc/Rok (00/00/0000)","Narodowość według paszportu. POL dla Polski. Jeśli inna, proszę wpisać pełną nazwę.","Kod PAS - dla paszportu","Numer paszportu według wzoru: LITERY spacja NUMER (AB 123456)","Kraj wydania paszportu. POL dla Polski. Jeśli inny, proszę wpisać pełną nazwę kraju.","Data ważności dokumentu (paszportu) według formatu: Dzień/Miesiąc/Rok (00/00/0000). Paszport musi być ważny min. 6 miesięcy od przekroczenia granicy Japonii.","Osoby poruszające się na wózku: YE - wózek elektryczny, YM - wózek manualny, N - nie porusza się","Numer telefonu komórkowego","Numer telefonu domowego (opcjonalnie)","Adres e-mail","Nazwa pliku ze zdjęciem z właściwym roszerzeniem: .jpg; .jpeg; .png; .bmp","Wzrost podany w centymetrach bez skrótu \"cm\": 000 ","Numer licencji lub inny numer odpowiadający przynalezności do federacji (opcjonalnie)","Wyrażenie zgody dla przynalezności do programu Athletes 365: Y-wyrażam zgodę; N-niewyrażam zgody","Adres e-mail udostępniony dla portalu Athletes 365","Kod FCB - Facebook","Nazwa konta w mediach społecznościowych podanych po lewej stronie.","Koda INS - Instagram","Nazwa konta w mediach społecznościowych podanych po lewej stronie.","Koda TWI - Twitter","Nazwa konta w mediach społecznościowych podanych po lewej stronie.","Koda SNA - Snapchat","Nazwa konta w mediach społecznościowych podanych po lewej stronie.",{"$f":"IF(ISERROR(VLOOKUP(C8,#REF!,2,FALSE)),\"\",VLOOKUP(C8,#REF!,2,FALSE))","v":""}]
["PRZYKŁAD M",null,null,null,null,"CHECINSKI","JAN","ADAM","Chęciński","Jan","Chęciński","Jan",null,null,"M","04/11/2001","POL","PAS","EG 237865","POL","31/12/2021","N",48501502503,"48 22 5078899","janchecinski@gmail.com","jan_checinski.jpg",173,null,"Y","janchecinski@gmail.com","FCB","facebook.com/checinski123","INS","instagram.com/checin123",null,null,null,null,{"$f":"IF(ISERROR(VLOOKUP(C9,#REF!,2,FALSE)),\"\",VLOOKUP(C9,#REF!,2,FALSE))","v":""}]
["PRZYKŁAD K",null,null,null,null,"DROZDZ","ANNA","MARIA","Sakevich","Anna-Maria","Drożdż","Anna-Maria",null,null,"F","17/04/1972","Ukraina","PAS","EB 145789","Ukraina","02/03/2022","N",null,null,null,null,null,null,null,null,"FCB","facebok.com/annamaria72",null,null,"TWI","twitter.com/anna_maria",null,null,{"$f":"IF(ISERROR(VLOOKUP(C10,#REF!,2,FALSE)),\"\",VLOOKUP(C10,#REF!,2,FALSE))","v":""}]
{"$rows_left_out":198}
{"sheet":"appcopy","index":2,"n_rows":0,"n_cols":0,"rows_kept":0,"cut":false,"hidden":true,"merged":[]}

{"sheet":"Texts","index":3,"n_rows":62,"n_cols":14,"rows_kept":62,"cut":false,"hidden":true,"merged":[]}
["(EN)","(FR)"," (JPN)"]
["Welcome","Bienvenu","ようこそ"]
["This template will aid in the submission of personal data to the Tokyo 2020 accreditation system. It will check for errors in the data that you are about to submit. Once all your data is correct, you will be able to generate an import file to load in the accreditation system.\n","Ce fichier aidera à la transmission des données personnelles au système d'accréditation de Tokyo 2020. Il vérifiera les erreurs dans les données que vous êtes sur le point de communiquer. Une fois que toutes vos données seront correctes, vous serez en mesure de générer un fichier d'importation dans le système d'accréditation.","このテンプレートは、東京2020のアクレディテーションシステムへの個人情報提出をサポートするものです。 \nこのテンプレートでは、データを提出する前にエラーがあるかどうかを確認することができます。 \n 全てのデータが正しい形式である場合のみ、アクレディテーションシステムに反映するためのインポート用ファイルを作成することができます。 \n "]
["Organisation:","Organisation:","組織:"]
["Tokyo 2020 Accreditation Contact:","Contact Accréditation de Tokyo 2020:","東京2020 アクレディテーション問い合わせ先:"]
["Template version: ","Version du fichier:","テンプレートのバージョン:"]
["Select your language:","Choisissez votre langue:","言語を選択して下さい:"]
["Select your date format:","Choisissez votre format de date:","記載する日付の形式を選択して下さい:"]
["Check Errors","Vérifier les erreurs","エラーを確認"]
["Generate Import File...","Générer fichier d'importation...","インポートファイルを作成"]
{"$rows_left_out":53}
{"sheet":"Data fields","index":4,"n_rows":42,"n_cols":12,"rows_kept":42,"cut":false,"hidden":true,"merged":[]}
[]
["ACR Import Fields","Upload Template Field (EN)","Upload Template Field (FR)","Upload Template Field (JPN)","Field Description (EN)","Field Description (FR)","Field Description (JPN)","SysLen","Required","Format","Formula","Comments to validate"]
["Registration number","Registration number","Registration number","Registration number",null,null,null,7,false,"TEXT/NUMBER"]
["Organisation","Organisation","Organisation","組織","Enter the Organisation CODE","Entrez le CODE de l’organisation","組織コードを入力",12,true,"CODE"]
["Function","Function","Fonction","役割","Enter the Function CODE","Entrez le code de la fonction","役割コードを入力",12,true,"CODE"]
["Discipline(s)","Discipline(s)","Discipine(s)","種別","Enter the discipline(s) CODE(s). Separate with comma (,) for more than one code","Entrez le(s) CODE(s) de discipine(s) Séparez avec une virgule (,) lorsque vous entrez plusieurs codes","種別コードを入力 (複数可)",150,false,"CODE","!Formula!","mandatory for some categories"]
["Venue(s)","Venue(s)","Lieu(s)","会場","Enter the venue(s) CODE(s). Separate with comma (,) for more than one code","Entrez le(s) CODE(s) de Site(s) Séparez avec une virgule (,) lorsque vous entrez plusieurs codes","会場コードを入力 (複数可)",150,false,"CODE","!Formula!","mandatory for some categories"]
["Family name","Family name","Nom de famille","姓 (ファミリーネーム)","Enter Family Name exactly as it appears on Identification Document","Entrez le nom de famille exactement tel qu'il apparaît sur la pièce d'identité","姓 (ファミリーネーム)を本人確認書類に記載されている通りに入力",25,true,"TEXT"]
["Given name","Given name","Prénom","名 (ファーストネーム)","Enter first Given Name exactly as it appears on Identification Document","Entrez le prénom exactement tel qu'il apparaît sur la pièce d'identité","名 (ファーストネーム)を本人確認書類に記載されている通りに入力",25,true,"TEXT"]
["Middle/other given name(s)","Middle/other given name(s)","Deuxième prénom/ Autre(s) nom(s)","ミドルネーム/その他のファーストネーム","Enter Middle/other given name(s) exactly as it appears on Identification Document","Entrez le Deuxième prénom/ Autre(s) nom(s) exactement tel qu'il apparaît sur la pièce d'identité","ミドルネーム・その他のファーストネームを本人確認書類に記載されている通りに入力",25,false,"TEXT"]
{"$rows_left_out":32}